{"text_format":"1","workbook":"xlsx","n_sheets":22,"sheets":["入力","諸元(編集可)","連携パターン","費用関数一覧","結果一覧","総合評価","結果一覧(実績値等入力可)","総合評価(実績値等入力時)","■マスタ（国総研専用）","■公開時に管理者以外は非表示とする⇒","シート一覧","汚泥処理フロー (日最大)","汚泥処理フロー(日平均)","資源利用量の算定","設備量の整理","建設費の算定","維持管理費の算定","収益の算定","既存更新の評価","結果まとめ","結果一覧 (既設更新参照用)","defnendo2015"],"not_rendered":{"charts":12,"images":2,"macros":1,"external_links":0,"defined_names":24,"comments":1,"pivot_tables":0},"unopened":[],"bounds":{"document_bytes":16777216,"sheet_cells":100000,"rows_first":2000,"rows_last":500,"rows_between":2000,"halvings":0,"cell_chars":16384,"cell_head_chars":4096},"cells_cut":0,"cells_raw":0,"read":"whole","date_system":"1900"}

{"sheet":"入力","index":0,"n_rows":38,"n_cols":11,"rows_kept":38,"cut":false,"hidden":false,"merged":[[5,1,5,5],[5,7,5,11]]}
[]
[]
[]
[]
[null,"※青字は必須項目"]
[null,"入力項目",null,null,null,null,null,"既存処理"]
{"$rows_left_out":33}
{"sheet":"諸元(編集可)","index":1,"n_rows":88,"n_cols":14,"rows_kept":88,"cut":false,"hidden":false,"merged":[[76,0,87,0],[76,1,87,1],[5,0,57,0],[58,0,75,0],[44,1,46,1],[9,1,17,1],[23,1,28,1],[4,0,4,1],[40,1,43,1],[54,1,57,1],[74,1,75,1],[35,1,39,1],[5,1,8,1],[18,1,22,1],[58,1,73,1],[47,1,53,1],[31,1,34,1],[29,1,30,1]]}
["シート名：諸元"]
[null,"試算条件の整理"]
[null,"※返流水の影響は考慮しない"]
[]
["項目",null,null,"値","単位","デフォルト値","設定根拠"]
["施設の運転に関する項目","処理場条件","水処理方法","標準法","-",{"$f":"'■マスタ（国総研専用）'!Q5","v":"標準法"},"-"]
{"$rows_left_out":83}
{"sheet":"連携パターン","index":2,"n_rows":0,"n_cols":0,"rows_kept":0,"cut":false,"hidden":false,"merged":[]}

{"sheet":"費用関数一覧","index":3,"n_rows":52,"n_cols":15,"rows_kept":52,"cut":false,"hidden":false,"merged":[[47,2,48,2],[47,8,48,8],[49,8,51,8],[38,2,42,2],[38,8,42,8],[43,2,44,2],[45,2,46,2],[43,8,44,8],[45,8,46,8],[49,2,51,2],[33,2,37,2],[17,8,18,8],[19,8,21,8],[25,8,27,8],[28,8,29,8],[33,8,34,8],[35,8,37,8],[17,2,18,2],[19,2,21,2],[22,2,24,2],[25,2,27,2],[28,2,29,2],[22,8,24,8],[30,8,31,8],[30,2,32,2],[9,8,13,8],[6,8,7,8],[5,2,8,2],[9,2,13,2],[14,8,15,8],[14,2,16,2]]}
["シート名：費用関数一覧"]
[]
[null,null,"費用関数一覧",null,null,null,null,null,null,null,null,"人件費","電力単価"]
[null,null,"建設費",null,null,null,null,null,null,null,null,{"$f":"'諸元(編集可)'!D88","v":5},{"$f":"'諸元(編集可)'!D77","v":15}]
[null,null,"設備","項目","費用関数",null,"費用関数設定年度","デフレーター","出典","a","b","ｃ","変数"]
[null,null,"前処理設備","前処理施設(建設費)","Y＝56.054Qw＾0.4491","百万円","2022年度（暫定）",{"$f":"_xlfn.XLOOKUP(G6,defnendo2015!$A$12:$A$85,defnendo2015!$AV$12:$AV$85,\"\",0,1)","v":118.6},"R4年度国総研調べ",56.054000000000002,0.4491,null,"生ごみ受入れ量"]
{"$rows_left_out":47}
{"sheet":"結果一覧","index":4,"n_rows":121,"n_cols":13,"rows_kept":121,"cut":false,"hidden":false,"merged":[]}
["シート名：結果一覧",null,"総額"]
[]
[]
[null,null,null,null,null,"既設更新","パターン１","パターン２","パターン３","パターン４","パターン５","パターン６","パターン７"]
[null,null,null,null,null,{"$f":"CONCATENATE(入力!K8,入力!K10)","v":"有肥料化(堆肥)"},"消化＋埋立","消化＋廃棄物側での処理","消化＋固形燃料化","消化＋乾燥汚泥肥料","消化＋コンポスト","消化＋リン回収","消化＋熱利用"]
[null,"建設費","前処理設備","機電","百万円",null,{"$f":"建設費の算定!N7","v":5.4},{"$f":"建設費の算定!N7","v":5.4},{"$f":"建設費の算定!N7","v":5.4},{"$f":"建設費の算定!N7","v":5.4},{"$f":"建設費の算定!N7","v":5.4},{"$f":"建設費の算定!N7","v":5.4},{"$f":"建設費の算定!N7","v":5.4}]
{"$rows_left_out":116}
{"sheet":"総合評価","index":5,"n_rows":115,"n_cols":18,"rows_kept":115,"cut":false,"hidden":false,"merged":[[34,12,34,13],[34,14,34,15],[34,16,34,17],[35,1,35,3],[35,4,35,5],[35,6,35,7],[35,8,35,9],[35,10,35,11],[35,12,35,13],[34,1,34,3],[34,4,34,5],[34,6,34,7],[34,8,34,9],[34,10,34,11],[35,14,35,15],[35,16,35,17],[38,12,43,13],[38,14,43,15],[38,16,43,17],[44,12,44,13],[44,14,44,15],[44,16,44,17],[36,1,44,1],[36,2,36,3],[36,4,36,5],[36,6,36,7],[36,8,36,9],[36,10,36,11],[36,12,36,13],[36,14,36,15],[36,16,36,17],[37,2,37,3],[37,4,37,5],[37,6,37,7],[37,8,37,9],[37,10,37,11],[37,12,37,13],[37,14,37,15],[37,16,37,17],[44,2,44,3],[44,4,44,5],[44,6,44,7],[44,8,44,9],[44,10,44,11],[38,0,43,0],[38,4,43,5],[38,6,43,7],[38,8,43,9],[38,10,43,11],[46,10,46,11],[46,12,46,13],[46,14,46,15],[46,16,46,17],[45,2,45,3],[45,4,45,5],[45,6,45,7],[45,8,45,9],[45,10,45,11],[47,0,52,0],[47,4,52,5],[47,6,52,7],[47,8,52,9],[47,10,52,11],[47,12,52,13],[47,14,52,15],[47,16,52,17],[53,2,53,3],[53,4,53,5],[53,6,53,7],[53,8,53,9],[53,10,53,11],[53,12,53,13],[53,14,53,15],[53,16,53,17],[45,1,53,1],[45,12,45,13],[45,14,45,15],[45,16,45,17],[46,2,46,3],[46,4,46,5],[46,6,46,7],[46,8,46,9],[56,6,56,7],[57,6,57,7],[61,2,61,3],[61,4,61,5],[61,6,61,7],[54,1,62,1],[54,4,54,5],[55,4,55,5],[56,4,56,5],[54,2,60,2],[54,3,60,3],[61,8,61,9],[61,10,61,11],[61,12,61,13],[61,14,61,15],[61,16,61,17],[62,2,62,3],[62,4,62,5],[62,6,62,7],[62,8,62,9],[62,10,62,11],[62,12,62,13],[62,14,62,15],[62,16,62,17],[63,1,63,3],[63,4,63,5],[63,6,63,7],[63,8,63,9],[63,10,63,11],[63,12,63,13],[63,14,63,15],[63,16,63,17],[64,1,64,3],[64,4,64,5],[64,6,64,7],[64,8,64,9],[64,10,64,11],[64,12,64,13],[64,14,64,15],[64,16,64,17]]}
["緑色セル：必要に応じて入力または選択"]
[]
[null,"適用性に関する設問",null,null,null,null,null,null,null,null,null,"重み付け（総合評価の配点）設定"]
[null,"下水道事業における課題"]
[null,null,"①汚泥処分費が課題となっている",null,null,null,null,null,null,null,null,null,"経済性",12,"点"]
[null,null,"回答","該当"]
{"$rows_left_out":110}
{"sheet":"結果一覧(実績値等入力可)","index":6,"n_rows":121,"n_cols":13,"rows_kept":121,"cut":false,"hidden":false,"merged":[]}
["シート名：結果一覧(編集可能)",null,"総額","緑色セル：編集可能"]
[]
[]
[null,null,null,null,null,"既設更新","パターン１","パターン２","パターン３","パターン４","パターン５","パターン６","パターン７"]
[null,null,null,null,null,{"$f":"CONCATENATE(入力!K8,入力!K10)","v":"有肥料化(堆肥)"},"消化＋埋立","消化＋廃棄物側での処理","消化＋固形燃料化","消化＋乾燥汚泥肥料","消化＋コンポスト","消化＋リン回収","消化＋熱利用"]
[null,"建設費","前処理設備","機電","百万円",null,5.4,5.4,5.4,5.4,5.4,5.4,5.4]
{"$rows_left_out":116}
{"sheet":"総合評価(実績値等入力時)","index":7,"n_rows":115,"n_cols":18,"rows_kept":115,"cut":false,"hidden":false,"merged":[[34,14,34,15],[34,16,34,17],[35,1,35,3],[35,4,35,5],[35,6,35,7],[35,8,35,9],[35,10,35,11],[35,12,35,13],[35,14,35,15],[35,16,35,17],[34,1,34,3],[34,4,34,5],[34,6,34,7],[34,8,34,9],[34,10,34,11],[34,12,34,13],[36,14,36,15],[36,16,36,17],[37,2,37,3],[37,4,37,5],[37,6,37,7],[37,8,37,9],[37,10,37,11],[37,12,37,13],[37,14,37,15],[36,2,36,3],[36,4,36,5],[36,6,36,7],[36,8,36,9],[36,10,36,11],[37,16,37,17],[46,6,46,7],[46,8,46,9],[46,10,46,11],[46,12,46,13],[46,14,46,15],[46,16,46,17],[38,0,43,0],[38,4,43,5],[38,6,43,7],[38,8,43,9],[38,10,43,11],[38,12,43,13],[38,14,43,15],[38,16,43,17],[36,1,44,1],[44,2,44,3],[44,4,44,5],[44,6,44,7],[44,8,44,9],[44,10,44,11],[44,12,44,13],[44,14,44,15],[44,16,44,17],[36,12,36,13],[47,0,52,0],[47,4,52,5],[47,6,52,7],[47,8,52,9],[47,10,52,11],[47,12,52,13],[47,14,52,15],[47,16,52,17],[53,14,53,15],[53,16,53,17],[53,8,53,9],[53,10,53,11],[53,12,53,13],[45,1,53,1],[45,2,45,3],[45,4,45,5],[45,6,45,7],[45,8,45,9],[45,10,45,11],[45,12,45,13],[45,14,45,15],[45,16,45,17],[46,2,46,3],[46,4,46,5],[54,1,62,1],[54,2,60,2],[54,3,60,3],[54,4,54,5],[55,4,55,5],[56,4,56,5],[56,6,56,7],[57,6,57,7],[53,2,53,3],[53,4,53,5],[53,6,53,7],[61,14,61,15],[61,16,61,17],[62,2,62,3],[62,4,62,5],[62,6,62,7],[62,8,62,9],[62,10,62,11],[62,12,62,13],[62,14,62,15],[62,16,62,17],[61,2,61,3],[61,4,61,5],[61,6,61,7],[61,8,61,9],[61,10,61,11],[61,12,61,13],[63,14,63,15],[63,16,63,17],[64,1,64,3],[64,4,64,5],[64,6,64,7],[64,8,64,9],[64,10,64,11],[64,12,64,13],[64,14,64,15],[64,16,64,17],[63,1,63,3],[63,4,63,5],[63,6,63,7],[63,8,63,9],[63,10,63,11],[63,12,63,13]]}
["緑色セル：必要に応じて入力または選択"]
[]
[null,"適用性に関する設問",null,null,null,null,null,null,null,null,null,"重み付け（総合評価の配点）設定"]
[null,"下水道事業における課題"]
[null,null,"①汚泥処分費が課題となっている",null,null,null,null,null,null,null,null,null,"経済性",12,"点"]
[null,null,"回答","該当"]
{"$rows_left_out":110}
{"sheet":"■マスタ（国総研専用）","index":8,"n_rows":88,"n_cols":29,"rows_kept":88,"cut":false,"hidden":true,"merged":[[57,13,74,13],[57,14,72,14],[73,14,74,14],[75,13,86,13],[75,14,86,14],[4,4,4,8],[4,14,7,14],[3,13,3,15],[4,13,56,13],[17,14,21,14],[28,14,29,14],[30,14,33,14],[34,14,38,14],[39,14,42,14],[43,14,45,14],[46,14,52,14],[53,14,56,14],[12,4,12,8],[8,14,16,14],[22,14,27,14]]}
["マスタシート",null,null,"※各種セルはマクロで利用しています。セルの挿入や削除は行わないでください。"]
[null,"マスタメニュー",null,null,null,null,null,null,null,null,null,null,"諸元シートデフォルト値",null,null,null,null,null,null,null,"コード値マスタ"]
[null,null,null,null,null,null,null,null,null,null,null,null,null,null,"P5セルからENDまでの値を諸元シートのD6セル以降にコピーします",null,null,null,null,null,null,"リストに追加すると、入力シートのプルダウンの内容に反映されます"]
[null,null,"シート保護",null,null,null,null,null,null,null,null,null,null,"項目",null,null,"デフォルト値","単位",null,null,null,null,"消化の有無",null,null,"脱水汚泥の処理",null,null,"事業者分類"]
[null,null,null,"状態","保護設定中",null,null,null,null,null,null,null,null,"施設の運転に関する項目","処理場条件","水処理方法","標準法","-",null,null,null,1,"有",null,1,"埋立",null,1,"公共"]
[null,null,null,null,null,null,null,null,null,null,null,null,null,null,null,"流入水SS",180,"mg/L",null,null,null,2,"無",null,2,"固形燃料化",null,2,"流域"]
{"$rows_left_out":83}
{"sheet":"■公開時に管理者以外は非表示とする⇒","index":9,"n_rows":1,"n_cols":1,"rows_kept":1,"cut":false,"hidden":true,"merged":[]}
["マスターシートにて、これより右側のシートとマスターシート自体を非表示にしてから公表"]

{"sheet":"シート一覧","index":10,"n_rows":18,"n_cols":9,"rows_kept":18,"cut":false,"hidden":true,"merged":[]}
["シート名：シート一覧"]
[]
[]
[null,"入力",null,null,null,null,"入力"]
[null,"諸元"]
[null,"費用関数一覧",null,null,null,null,"諸元"]
{"$rows_left_out":13}
{"sheet":"汚泥処理フロー (日最大)","index":11,"n_rows":26,"n_cols":17,"rows_kept":26,"cut":false,"hidden":true,"merged":[]}
["シート名：汚泥処理フロー"]
[null,null,null,null,null,null,null,null,null,null,"GHG算定",null,null,null,"既設処理の場合"]
[]
[null,"汚泥発生量",null,null,null,null,null,null,null,null,"汚泥処理量増加分",null,null,null,"生ごみ受け入れ無し(消化実施)"]
[null,"生汚泥固形物量",{"$f":"(入力!D8*'諸元(編集可)'!D7/1000) *'諸元(編集可)'!D8/100","v":1800},"kg/日",null,null,null,null,null,null,"希釈後含水率",{"$f":"'諸元(編集可)'!D16","v":90},"％",null,"消化ガス発電(下水汚泥のみ)"]
[null,"余剰汚泥固形物量",{"$f":"((入力!D8*'諸元(編集可)'!D7/1000)-C5)*'諸元(編集可)'!D9/100","v":1548},"kg/日",null,null,null,null,null,null,"汚泥増加量",{"$f":"G16/(1-L5/100)","v":4.8},"t-wet/日",null,"ガス投入量",{"$f":"C16","v":1473.1200000000001},"N㎥/日"]
{"$rows_left_out":21}
{"sheet":"汚泥処理フロー(日平均)","index":12,"n_rows":26,"n_cols":17,"rows_kept":26,"cut":false,"hidden":true,"merged":[]}
["シート名：汚泥処理フロー"]
[null,null,null,null,null,null,null,null,null,null,"GHG算定",null,null,null,"既設処理の場合"]
[]
[null,"汚泥発生量",null,null,null,null,null,null,null,null,"汚泥処理量増加分",null,null,null,"生ごみ受け入れ無し(消化実施)"]
[null,"生汚泥固形物量",{"$f":"(入力!D10*'諸元(編集可)'!D7/1000) *'諸元(編集可)'!D8/100","v":1350},"kg/日",null,null,null,null,null,null,"希釈後含水率",{"$f":"'諸元(編集可)'!D16","v":90},"％",null,"消化ガス発電(下水汚泥のみ)"]
[null,"余剰汚泥固形物量",{"$f":"((入力!D10*'諸元(編集可)'!D7/1000)-C5)*'諸元(編集可)'!D9/100","v":1161},"kg/日",null,null,null,null,null,null,"汚泥増加量",{"$f":"G16/(1-L5/100)","v":4.8},"t-wet/日",null,"ガス投入量",{"$f":"C16","v":1104.8400000000004},"N㎥/日"]
{"$rows_left_out":21}
{"sheet":"資源利用量の算定","index":13,"n_rows":70,"n_cols":53,"rows_kept":70,"cut":false,"hidden":true,"merged":[]}
["シート名：資源利用量の算定"]
[null,null,null,null,null,null,null,null,"既存処理"]
[null,"汚泥発生量",null,null,null,null,null,null,"乾燥",null,null,null,null,null,"炭化",null,null,null,null,null,"堆肥化",null,null,null,null,null,"焼却",null,null,null,null,null,"廃熱利用",null,null,null,null,null,"埋立",null,null,null,null,null,"リン回収"]
[null,"No","項目","値","単位","算定方法",null,null,"No","項目","値","単位","算定方法",null,"No","項目","値","単位","算定方法",null,"No","項目","値","単位","算定方法",null,"No","項目","値","単位","算定方法",null,"No","項目","値","単位","算定方法",null,"No","項目","値","単位","算定方法",null,"No","項目","値","単位","算定方法"]
[null,"①","流入水量(日平均)",{"$f":"入力!D10","v":15000},"㎥/日","与条件「入力値」",null,null,null,"発生汚泥固形物量",{"$f":"D11","v":2511},"kg-DS/日","⑦",null,null,"発生汚泥固形物量",{"$f":"D11","v":2511},"kg-DS/日","⑦",null,null,"発生汚泥固形物量",{"$f":"$D$11","v":2511},"kg-DS/日","⑦",null,null,"発生汚泥固形物量",{"$f":"$D$11","v":2511},"kg-DS/日","⑦",null,null,"発生汚泥固形物量",{"$f":"$D$11","v":2511},"kg-DS/日","⑦",null,null,"発生汚泥固形物量",{"$f":"$D$11","v":2511},"kg-DS/日","⑦",null,null,"消化液リン濃度",null,"mg/L","消化未実施のため０"]
[null,"②","流入水SS",{"$f":"'諸元(編集可)'!D7","v":180},"mg/L","与条件「参考資料*1を基に設定 」",null,null,null,"脱水汚泥含水率",{"$f":"'諸元(編集可)'!$D$31","v":80},"％",null,null,null,"脱水汚泥含水率",{"$f":"'諸元(編集可)'!$D$31","v":80},"％",null,null,null,"脱水汚泥含水率",{"$f":"'諸元(編集可)'!$D$31","v":80},"％",null,null,null,"脱水汚泥含水率",{"$f":"'諸元(編集可)'!$D$31","v":80},"％",null,null,null,"脱水汚泥含水率",{"$f":"'諸元(編集可)'!$D$31","v":80},"％",null,null,null,"脱水汚泥含水率",{"$f":"'諸元(編集可)'!$D$31","v":80},"％",null,null,null,"濃縮汚泥量(リン回収処理水量)",null,"㎥/日","消化未実施のため０"]
{"$rows_left_out":65}
{"sheet":"設備量の整理","index":14,"n_rows":43,"n_cols":7,"rows_kept":43,"cut":false,"hidden":true,"merged":[]}
["シート名：設備量の整理"]
[null,"生ごみ受入れに伴う設備費用算定に必要な項目整理"]
[null,"各パターンについて、下水汚泥利活用施設全体を整備と仮定し必要基数等を試算"]
["設備新規建設"]
[null,"設備","算定に必要な項目","能力等(費用算定に必要な項目)","1基当たりの能力設定値","単位","設置基数"]
[null,"生ごみ受入れ量","生ごみ処理量",{"$f":"入力!D12*'諸元(編集可)'!D10","v":3.5999999999999996},{"$f":"IF(D6<60,D6,60)","v":3.5999999999999996},"t/日",{"$f":"IF(D6>0,ROUNDUP(D6/E6,0),0)","v":1}]
{"$rows_left_out":38}
{"sheet":"建設費の算定","index":15,"n_rows":42,"n_cols":15,"rows_kept":42,"cut":false,"hidden":true,"merged":[]}
["シート名：建設費の算定"]
[]
[null,null,"デフレーター(検討時点)",null,"2024年度（暫定）",{"$f":"IF(入力!D16=\"\",_xlfn.XLOOKUP(E3,defnendo2015!$A$12:$A$85,defnendo2015!$AV$12:$AV$85,\"\",0,1),入力!D16)","v":127.9},"(入力値がある場合入力値)"]
[]
[null,null,null,null,null,null,null,null,null,null,"年価の計算"]
[null,null,null,null,"既設更新(消化なし)","既設更新(消化あり)","生ごみ受入れ",null,null,null,"耐用年数","既設更新","既設更新(消化あり)","生ごみ受入れ(試算)"]
{"$rows_left_out":37}
{"sheet":"維持管理費の算定","index":16,"n_rows":31,"n_cols":19,"rows_kept":31,"cut":false,"hidden":true,"merged":[]}
["シート名：維持管理費の算定"]
[null,null,"デフレーター","2024年度（暫定）",{"$f":"IF(入力!D16=\"\",_xlfn.XLOOKUP(D2,defnendo2015!$A$12:$A$85,defnendo2015!$AV$12:$AV$85,\"\",0,1),入力!D16)","v":127.9},"(入力値がある場合入力値)"]
[]
[null,null,null,null,"既設更新(消化なし)","既設更新(消化あり)","生ごみ受入れ(試算)"]
[null,"前処理設備(生ごみ受入れマニュアル)","電気使用料金","百万円",null,null,{"$f":"ROUND(((費用関数一覧!J7*設備量の整理!E6^費用関数一覧!K7)*5*365*費用関数一覧!M4/10^6)*(E2/費用関数一覧!H7),1)","v":0.9}]
[null,null,"補修費","百万円",null,null,{"$f":"ROUND(建設費の算定!G7*3/100,1)","v":3.2},"(出典の費用関数が機電のみなので機電の3％として算定,建設費にデフレータがあるので維持管理費では補正無し)"]
{"$rows_left_out":26}
{"sheet":"収益の算定","index":17,"n_rows":23,"n_cols":28,"rows_kept":23,"cut":false,"hidden":true,"merged":[]}
["シート名：収益の算定"]
[null,"収益"]
[null,"項目",null,"単位","単価",null,"既設更新(消化なし)","既設更新(消化あり)","生ごみ受入れ(試算)","備考"]
[null,"消化ガス発電(売電)","売電収益","百万円/年",{"$f":"'諸元(編集可)'!D79","v":35},"円/kWh","ー",{"$f":"ROUND('汚泥処理フロー(日平均)'!$P$10*365*収益の算定!E4/10^6,3)","v":19.399000000000001},{"$f":"ROUND((('汚泥処理フロー(日平均)'!$P$10*365)+(('汚泥処理フロー(日平均)'!$G$25-'汚泥処理フロー(日平均)'!$P$10)*365*(入力!$D$14/7)))*収益の算定!E4/10^6,3)","v":24.832999999999998},"全ケース(売電の場合：参考値)"]
[null,"消化ガス発電(場内利用)","維持管理費削減効果","百万円/年",{"$f":"'諸元(編集可)'!D77","v":15},"円/kWh","ー",{"$f":"ROUND('汚泥処理フロー(日平均)'!$P$10*365*収益の算定!E5/10^6,3)","v":8.3140000000000001},{"$f":"ROUND((('汚泥処理フロー(日平均)'!$P$10*365)+(('汚泥処理フロー(日平均)'!$G$25-'汚泥処理フロー(日平均)'!$P$10)*365*(入力!$D$14/7)))*収益の算定!E5/10^6,3)","v":10.643000000000001},"全ケース"]
[null,"固形燃料","売却収益","百万円/年",{"$f":"'諸元(編集可)'!D80","v":100},"円/t",{"$f":"ROUND((資源利用量の算定!Q13*365/1000)*収益の算定!E6/10^6,3)","v":7.2999999999999995E-2},{"$f":"ROUND((資源利用量の算定!Q30*365/1000)*収益の算定!E6/10^6,3)","v":4.2000000000000003E-2},{"$f":"ROUND(((資源利用量の算定!Q30*365/1000)+(資源利用量の算定!Q66*365*(入力!D14/7)/1000))*収益の算定!E6/10^6,3)","v":4.3999999999999997E-2},"パターン3"]
{"$rows_left_out":18}
{"sheet":"既存更新の評価","index":18,"n_rows":15,"n_cols":16,"rows_kept":15,"cut":false,"hidden":true,"merged":[]}
["シート名：既存更新の評価"]
[]
[null,"既設更新(消化有)"]
[null,null,null,"有埋立","有固形燃料化","有肥料化(乾燥)","有肥料化(堆肥)","有リン利用","有焼却熱利用",null,"無埋立","無固形燃料化","無肥料化(乾燥)","無肥料化(堆肥)","無リン利用","無焼却熱利用"]
[null,null,null,"消化＋埋立","消化＋固形燃料化","消化＋乾燥汚泥肥料","消化＋コンポスト","消化＋リン回収","消化＋熱利用",null,"埋立","固形燃料化","乾燥汚泥肥料","コンポスト","リン回収","熱利用"]
[null,"建設費年価","百万円/年",{"$f":"建設費の算定!M16+建設費の算定!M18+建設費の算定!M29+建設費の算定!M32+建設費の算定!M22","v":146.4},{"$f":"建設費の算定!M16+建設費の算定!M18+建設費の算定!M29+建設費の算定!M32+建設費の算定!M22+建設費の算定!M38","v":207.10000000000002},{"$f":"建設費の算定!M16+建設費の算定!M18+建設費の算定!M29+建設費の算定!M32+建設費の算定!M22+建設費の算定!M35","v":198},{"$f":"建設費の算定!M16+建設費の算定!M18+建設費の算定!M29+建設費の算定!M32+建設費の算定!M22+建設費の算定!M40","v":231},{"$f":"建設費の算定!M16+建設費の算定!M18+建設費の算定!M29+建設費の算定!M32+建設費の算定!M22+建設費の算定!M42","v":159.9},{"$f":"建設費の算定!M16+建設費の算定!M18+建設費の算定!M29+建設費の算定!M32+建設費の算定!M22+建設費の算定!M27","v":302.89999999999998},null,{"$f":"建設費の算定!L22","v":51.6},{"$f":"建設費の算定!L22+建設費の算定!L38","v":130.20000000000002},{"$f":"建設費の算定!L22+建設費の算定!L35","v":115.4},{"$f":"建設費の算定!L22+建設費の算定!L40","v":163.9},"ー",{"$f":"建設費の算定!L22+建設費の算定!L27","v":250.4}]
{"$rows_left_out":10}
{"sheet":"結果まとめ","index":19,"n_rows":44,"n_cols":22,"rows_kept":44,"cut":false,"hidden":true,"merged":[[36,1,37,1],[36,2,37,2],[36,12,37,12],[36,13,37,13],[18,1,19,1],[18,2,19,2],[31,1,31,2],[29,1,29,2],[25,1,25,2]]}
["シート名：結果まとめ"]
[null,null,null,null,null,null,null,null,null,null,null,null,"国費を考慮した事業者負担割合",null,{"$f":"IF(入力!J12=1,1-0.55,1-2/3)","v":0.44999999999999996}]
[]
[null,null,null,"既設更新","連携パターン１","連携パターン２","連携パターン３","連携パターン４","連携パターン５","連携パターン６","連携パターン７",null,null,null,"既設更新","連携パターン１","連携パターン２","連携パターン３","連携パターン４","連携パターン５","連携パターン６","連携パターン７"]
[null,"項目","単位",{"$f":"CONCATENATE(入力!K8,入力!K10)","v":"有肥料化(堆肥)"},"消化＋埋立","消化＋廃棄物側での処理","消化＋固形燃料化","消化＋乾燥汚泥肥料","消化＋コンポスト","消化＋リン回収","消化＋熱利用",null,null,null,{"$f":"CONCATENATE(入力!V6,入力!V8)","v":""},"消化＋埋立","消化＋廃棄物側での処理","消化＋固形燃料化","消化＋乾燥汚泥肥料","消化＋コンポスト","消化＋リン回収","消化＋熱利用"]
[null,"建設費年価","百万円/年",{"$f":"_xlfn.XLOOKUP($D$5,既存更新の評価!$D$4:$P$4,既存更新の評価!$D6:$P6,\"\",0,1)","v":231},{"$f":"建設費の算定!N9+建設費の算定!N13+建設費の算定!N16+建設費の算定!N18+建設費の算定!N22+建設費の算定!N29+建設費の算定!N32","v":163.29999999999998},{"$f":"建設費の算定!N9+建設費の算定!N13+建設費の算定!N16+建設費の算定!N18+建設費の算定!N22+建設費の算定!N29+建設費の算定!N32","v":163.29999999999998},{"$f":"建設費の算定!N9+建設費の算定!N13+建設費の算定!N16+建設費の算定!N18+建設費の算定!N22+建設費の算定!N38+建設費の算定!N29+建設費の算定!N32","v":223.99999999999997},{"$f":"建設費の算定!N9+建設費の算定!N13+建設費の算定!N16+建設費の算定!N18+建設費の算定!N22+建設費の算定!N35+建設費の算定!N29+建設費の算定!N32","v":214.89999999999998},{"$f":"建設費の算定!N9+建設費の算定!N13+建設費の算定!N16+建設費の算定!N18+建設費の算定!N22+建設費の算定!N40+建設費の算定!N29+建設費の算定!N32","v":247.89999999999998},{"$f":"建設費の算定!N9+建設費の算定!N13+建設費の算定!N16+建設費の算定!N18+建設費の算定!N22+建設費の算定!N42+建設費の算定!N29+建設費の算定!N32","v":176.79999999999998},{"$f":"建設費の算定!N9+建設費の算定!N13+建設費の算定!N16+建設費の算定!N18+建設費の算定!N22+建設費の算定!N27+建設費の算定!N29+建設費の算定!N32","v":319.79999999999995},null,"建設費年価","百万円/年",{"$f":"D6*$O$2","v":103.94999999999999},{"$f":"E6*$O$2","v":73.484999999999985},73.484999999999985,100.79999999999998,{"$f":"H6*$O$2","v":96.704999999999984},111.55499999999998,79.559999999999988,143.90999999999997]
{"$rows_left_out":39}
{"sheet":"結果一覧 (既設更新参照用)","index":20,"n_rows":106,"n_cols":13,"rows_kept":106,"cut":false,"hidden":true,"merged":[]}
["シート名：結果まとめ内訳詳細ver",null,"総額"]
[]
[null,null,null,null,null,"既設更新","パターン１","パターン２","パターン３","パターン４","パターン５","パターン６","パターン７"]
[null,null,null,null,null,{"$f":"CONCATENATE(入力!K8,入力!K10)","v":"有肥料化(堆肥)"},"消化＋埋立","消化＋廃棄物側での処理","消化＋固形燃料化","消化＋乾燥汚泥肥料","消化＋コンポスト","消化＋リン回収","消化＋熱利用"]
[null,"建設費","前処理設備","機電","百万円",null,{"$f":"建設費の算定!N7","v":5.4},{"$f":"建設費の算定!N7","v":5.4},{"$f":"建設費の算定!N7","v":5.4},{"$f":"建設費の算定!N7","v":5.4},{"$f":"建設費の算定!N7","v":5.4},{"$f":"建設費の算定!N7","v":5.4},{"$f":"建設費の算定!N7","v":5.4}]
[null,null,null,"建築","百万円",null,{"$f":"建設費の算定!N8","v":4},{"$f":"建設費の算定!N8","v":4},{"$f":"建設費の算定!N8","v":4},{"$f":"建設費の算定!N8","v":4},{"$f":"建設費の算定!N8","v":4},{"$f":"建設費の算定!N8","v":4},{"$f":"建設費の算定!N8","v":4}]
{"$rows_left_out":101}
{"sheet":"defnendo2015","index":21,"n_rows":95,"n_cols":76,"rows_kept":95,"cut":false,"hidden":true,"merged":[]}
["シート名：defnendo2015","建設工事費デフレーター（2015年度基準）"]
[null,"［年度別］",null,"2025年03月31日付け"]
[null,1,2,3,4,5,6,7,8,9,10,11,12,13,14,15,16,17,18,19,20,21,22,23,24,25,26,27,28,29,30,31,32,33,34,35,36,37,38,39,40,41,42,43,44,45,46,47]
["年度","建設総合","建設総合","建設総合","建設総合","建設総合","建設総合","建設総合","建設総合","建設総合","建設総合","建設総合","建設総合","建設総合","建設総合","建設総合","建設総合","建設総合","建設総合","建設総合","建設総合","建設総合","建設総合","建設総合","建設総合","建設総合","建設総合","建設総合","建設総合","建設総合","建設総合","建設総合","建設総合","建設総合","建設総合","建設総合","建設総合","建設総合","建設総合","建設総合","建設総合","建設総合","建設総合","建設総合","建設総合","建設総合","建設総合","建設総合","建設総合","建設総合","建設総合","建設総合","建設総合","建設総合","建設総合","建設総合","建設総合","建設総合","建設総合","建設総合","建設総合","W在来住宅","W量産住宅","RC在来住宅","RC量産住宅","S在来住宅","S量産住宅","W工場・倉庫","W事務所・その他","SRC工場・倉庫","SRC事務所・その他","RC工場・倉庫","RC学校","RC事務所・その他","S工場・倉庫","S事務所・その他"]
["年度","建設総合","建築総合","建築総合","建築総合","建築総合","建築総合","建築総合","建築総合","建築総合","建築総合","建築総合","建築総合","建築総合","建築総合","建築総合","建築総合","建築補修","土木総合","土木総合","土木総合","土木総合","土木総合","土木総合","土木総合","土木総合","土木総合","土木総合","土木総合","土木総合","土木総合","土木総合","土木総合","土木総合","土木総合","土木総合","土木総合","土木総合","土木総合","土木総合","土木総合","土木総合","土木総合","土木総合","土木総合","土木総合","土木総合","土木総合","土木総合","土木総合","土木総合","土木総合","土木総合","土木総合","土木総合","土木総合","土木総合","土木総合","土木総合","土木総合","土木総合","W在来住宅","W量産住宅","RC在来住宅","RC量産住宅","S在来住宅","S量産住宅","W工場・倉庫","W事務所・その他","SRC工場・倉庫","SRC事務所・その他","RC工場・倉庫","RC学校","RC事務所・その他","S工場・倉庫","S事務所・その他"]
["年度","建設総合","建築総合","住宅総合","住宅総合","住宅総合","住宅総合","住宅総合","住宅総合","住宅総合","非住宅総合","非住宅総合","非住宅総合","非住宅総合","非住宅総合","非住宅総合","非住宅総合","建築補修","土木総合","公共事業","公共事業","公共事業","公共事業","公共事業","公共事業","公共事業","公共事業","公共事業","公共事業","公共事業","公共事業","公共事業","公共事業","公共事業","公共事業","公共事業","公共事業","公共事業","公共事業","公共事業","公共事業","公共事業","公共事業","公共事業","公共事業","公共事業","公共事業","公共事業","公共事業","公共事業","公共事業","公共事業","公共事業","公共事業","その他土木","その他土木","その他土木","その他土木","その他土木","その他土木","その他土木","W在来住宅","W量産住宅","RC在来住宅","RC量産住宅","S在来住宅","S量産住宅","W工場・倉庫","W事務所・その他","SRC工場・倉庫","SRC事務所・その他","RC工場・倉庫","RC学校","RC事務所・その他","S工場・倉庫","S事務所・その他"]
{"$rows_left_out":89}